ï»¿University_enrollment,Above_18_screening_Question,First_yr_undergrad_Question,Currently_enrolled_program,Currently_enrolled_program_other,Current_major_Original_Arabic_english,Current_major_English,GPA_impacted_during_pandemic,Exercise,Follow_healthy_diet_before_pandemic,Follow_healthy_diet_during_pandemic,Household_income,Household_income_if_dollars,Household_income_if_LBP,Cigarette_smoking_behavior_during_pandemic,Shisha_smoking_behavior_during_pandemic,Alcohol_consumption_behavior_during_pandemic,Physical_activity_behavior_during_pandemic,Sleeping_hours_before_pandemic,Sleeping_hours_during_pandemic,Hours_internet_before_pandemic,Hours_internet_during_pandemic,Overall_Health_self_rated,Priv_couns_therapy_mental_health_pro_Family_Physician,Priv_couns_therapy_mental_health_pro_Psychiatrist,Priv_couns_therapy_mental_health_pro_Psychologist,Priv_couns_therapy_mental_health_pro_Social_worker,Priv_couns_therapy_mental_health_pro_Another_Clinical_MH_Prof,Priv_couns_therapy_mental_health_pro_Mindful_using_app_video,Priv_couns_therapy_mental_health_pro_Mindful_without_app_video,Priv_couns_therapy_mental_health_pro_MH_sites_apps,Engaged_mindfulness_Meditation_using_app_video,Engaged_mindfulness_Meditation_Face_to_Face,Life_event_seeking_treatment_Beirut_Blast,Life_event_seeking_treatment_Econ_finan_hardship,Life_event_seeking_treatment_Reg_instability,Life_event_seeking_treatment_Tuition_increase,Life_event_seeking_treatment_Uni_layoff,Life_event_seeking_treatment_other,Asked_for_treatment,Treatment_Cat,PHQ_1,PHQ_2,PHQ_3,PHQ_4,PHQ_5,PHQ_6,PHQ_7,PHQ_8,PHQ_9,BAI_1,BAI_2,BAI_3,BAI_4,BAI_5,BAI_6,BAI_7,BAI_8,BAI_9,BAI_10,BAI_11,BAI_12â,BAI_13,BAI_14,BAI_15,BAI_16,BAI_17,BAI_18,BAI_19,BAI_20,BAI_21,PSS_1,PSS_2,PSS_3,PSS_4,PSS_5,PSS_6,PSS_7,PSS_8,PSS_9,PSS_10,QoLS_1,QoLS_2,QoLS_3,QoLS_4,QoLS_5,QoLS_6,QoLS_7,QoLS_8,QoLS_9,QoLS_10,QoLS_11,QoLS_12,QoLS_13,QoLS_14,QoLS_15,QoLS_16,Gender,Gender_other,Age,Nationality_original_Arabic_english,Nationality_English,Preferred_Language_MH_Intervention,Preferred_Language_MH_Intervention_other,Relationship_status,Relationship_status_other,Currently_living_Alone,Currently_living_Intimate_Partner,Currently_living_Family_Members,Currently_living_Not_Family_Members,Currently_living_Other,Number_household_members,Importance_Religion_decision,Adhere_COVID19_prev_measures_during_pandemic,COVID_Vaccinated,Vaccine_type_if_vaccinated,Vaccine_type_if_vaccinated_other,Vaccinated_in_Lebanon,Willing_to_take_vaccine_if_not_vaccinated,Conspiracy_behind_COVID_virus_vaccine,Follow_COVID19_updates,Major_source_COVID19_updates_Newspapers,Major_source_COVID19_updates_TV,Major_source_COVID19_updates_Online_website,Major_source_COVID19_updates_Facebook,Major_source_COVID19_updates_Twitter,Major_source_COVID19_updates_Social_media_platfor,Major_source_COVID19_updates_LebaneseGover,Major_source_COVID19_updates_Non_LebaneseGover,Major_source_COVID19_updates_Academic_Instit,Major_source_COVID19_updates_Dont_follow_updates,Infected_COVID19,Severity_if_infected_COVID19,PHQ_9_SCORE,PHQ_9_Cat,PHQ_9_Binary,BAI_21_SCORE,BAI_21_Cat,BAI_21_Binary,PSS_10_SCORE,PSS_10_Cat,PSS_10_Binary,QoLS_16_SCORE,Relationship_status_CAT,Priv_couns_therapy_mental_health_pro_Family_Physician_Cat,Priv_couns_therapy_mental_health_pro_Psychiatrist_Cat,Priv_couns_therapy_mental_health_pro_Psychologist_Cat,Priv_couns_therapy_mental_health_pro_Social_worker_cat,Priv_couns_therapy_mental_health_pro_Another_Clinical_MH_Prof_ca,Priv_couns_therapy_mental_health_pro_Mindful_using_app_video_cat,Priv_couns_therapy_mental_health_pro_Min_without_app_video_Cat,Priv_couns_therapy_mental_health_pro_MH_sites_apps_Cat,Priv_couns_SUM,PRIVATE_Couns_Binary,GPA_impact_CAT,Follow_Healthy_Diet_BFR,Follow_Healthy_Diet_DUR,Cigarette_DUR,Shisha_DUR,Alcohol_DUR,Physical_Activity_DUR,Internet_USE_BFR,Internet_USE_DUR,Adherence_Measures_CAT,Conspiracy_CAT,Adherence_CAT,Religion_importance_CAT,PHQ_9_3CAT,BAI_3CAT,Gender_2CAT,Household_income_ALL_Dollars,PSS_10_Cat_27_cutoff,HH_income_Binary
2,1,0,1, ,Biology,4,1,2,2,2,1, ,4,1,1,1,2,1,3,4,5,2,0,0,0,0,0,0,0,0,0,0,0,0,0,0,0,.,0,0,1,1,1,1,1,1,1,1,0,1,0,0,1,0,0,0,0,0,1,0,0,0,0,0,0,0,0,0,0,1,1,0,1,4,3,0,3,3,1,2,3,2,3,2,3,6,5,4,3,3,4,3,3,5,5,5,1, ,19,ÙØ¨ÙØ§ÙÙ,1,1, ,5, ,0,0,1,0, ,5,3,4,1,1, ,1, ,3,2,0,0,0,0,1,0,0,0,0,0,0, ,8,2,0,4,1,0,18,2,0,59,0,0,0,0,0,0,0,0,0,0,0,1,1,1,1,1,1,2,4,5,2,2,1,1,2,1,1,1,0,1
2,1,0,4, ,Dentistry,18,2,2,3,3,1, ,5,1,1,4,1,1,2,3,3,4,0,0,0,0,0,0,0,3,0,0,0,1,0,0,0, ,1,1,1,1,0,1,1,1,0,0,0,0,0,0,0,2,0,0,0,0,2,2,0,0,0,0,0,1,0,0,0,0,2,2,2,1,1,2,2,1,2,1,7,7,7,7,4,4,6,4,7,7,6,6,5,6,6,6,2, ,23,Lebanese,1,3, ,7, ,0,0,1,0, ,5,4,4,1,1, ,1, ,3,2,0,1,0,0,0,0,0,0,0,0,1,3,5,2,0,7,1,0,16,2,0,95,1,0,0,0,0,0,0,0,1,1,1,1,2,2,1,1,3,1,3,3,2,2,1,1,2,1,2,1,0,1
2,1,0,3, ,Science de la vie et de la terre,4,5,2,2,2,1, ,5,1,3,1,2,2,3,3,5,3,0,0,0,0,0,0,0,0,0,0,0,0,0,0,0,ÙÙ Ø§Ø°ÙØ¨ Ø§ÙÙ Ø¹ÙØ§Ø¬ ÙØ§,0,0,1,1,1,1,1,0,0,0,0,0,0,0,0,2,0,0,0,0,1,0,0,0,0,0,0,0,0,0,0,0,0,2,3,1,2,2,1,2,2,2,6,4,6,4,6,5,4,3,4,6,4,5,4,3,3,6,2, ,20,ÙØ¨ÙØ§ÙÙØ©,1,3, ,6, ,0,0,1,0, ,5,4,3,1,1, ,1, ,3,2,0,0,1,1,0,0,1,0,0,0,0, ,5,2,0,3,1,0,17,2,0,73,1,0,0,0,0,0,0,0,0,0,0,3,1,1,1,2,1,2,3,5,2,2,1,1,2,1,2,1,0,1
2,1,0,5, ,Biology,4,5,2,1,1,1, ,5,1,1,1,3,2,2,3,4,3,0,0,0,0,0,0,0,0,3,0,0,0,1,0,0, ,1,1,1,2,1,2,1,0,0,0,0,0,0,0,1,1,1,0,0,1,2,0,2,0,0,0,1,1,0,0,0,0,1,0,2,2,3,3,0,2,2,0, , , , , , , , , , , , , , , , , , , , , , , , , , , , , , , , , , , , , , , , , , , , , , , , , , , , ,7,2,0,10,2,0,15,2,0, , ,0,0,0,0,0,0,0,0,0,0,3,1,1,1,1,1,2,3,4, , , , ,2,2, ,1,0,1
2,1,0,3, ,Computer science-Maths appliquÃ©,16,5,1,2,4,1, ,3,1,1,1,1,1,2,2,4,2,0,0,0,0,0,0,0,0,0,0,0,0,0,0,0,ÙÙ Ø£ØªÙÙÙ Ø£Ù Ø¹ÙØ§Ø¬ ÙÙØ³Ù,0,0,2,2,1,2,2,1,1,1,0,1,0,0,1,1,2,1,2,0,3,1,0,0,1,0,1,0,3,0,0,2,4,2,4,2,2,2,2,2,3,3,3,5,5,5,5,4,4,3,2,5,3,6,2,3,2,4,2, ,20,ÙØ¨ÙØ§ÙÙØ©,1,1, ,6, ,0,0,1,0, ,5,0,4,0, , , ,1,2,1,0,0,0,1,0,0,0,0,0,0,0, ,12,3,1,19,3,1,26,2,1,61,1,0,0,0,0,0,0,0,0,0,0,3,1,2,1,1,1,1,2,4,2,1,1,0,2,2,2,1,0,1
2,1,0,3,Master,Science de la vie et de la terre,4,3,2,3,3,1, ,3,1,1,1,3,1,2,2,3,4,0,0,0,0,0,0,0,0,0,0,0,1,0,0,0, ,1,1,2,1,0,0,1,1,0,1,1,0,0,0,0,3,1,1,3,3,3,0,0,0,0,0,2,3,1,0,0,0,2,1,2,2,3,1,2,3,2,2,6,5,6,6,6,7,7,7,7,7,6,6,6,6,6,5,2, ,20,ÙØ¨ÙØ§ÙÙØ©,1,3,ÙØ²ÙØ¬ ÙÙ Ø§ÙØ¹Ø±Ø¨ÙØ© Ù Ø§ÙÙØ±ÙØ³ÙØ© Ù Ø§ÙØ§ÙØ¬ÙÙØ²ÙØ©,5, ,0,0,1,0, ,6,2,4,1,1, ,1, ,3,4,0,1,1,1,0,1,1,1,1,0,0, ,7,2,0,20,3,1,20,2,0,99,0,0,0,0,0,0,0,0,0,0,0,2,2,2,1,1,1,2,2,3,2,2,1,1,2,2,2,1,0,1
2,1,0,3, ,Ø¹ÙÙ Ø§ÙÙÙØ³ Ø§ÙØ¹ÙØ§Ø¯Ù,1,3,2,3,3,2,3, ,1,1,1,1,2,2,3,3,4,0,0,0,0,0,0,0,0,0,0,0,0,0,0,0,ÙØ§ ÙÙØ¬Ø¯,0,0,0,0,0,0,0,0,0,0,0,0,0,0,0,0,0,0,0,0,0,0,0,0,0,0,0,0,0,0,0,0,0,0,0,4,1,0,1,1,0,0,6,6,6,7,7,6,7,7,7,6,6,6,6,6,6,6,1, ,34,ÙØ¨ÙØ§ÙÙ,1,1, ,2, ,0,0,0,0,Ø²ÙØ¬ØªÙ ÙØ§ÙÙØ§Ø¯Ù,5,4,4,0, , , ,1,2,3,1,0,1,1,0,0,0,0,1,0,1,2,0,1,0,0,1,0,7,1,0,101,1,0,0,0,0,0,0,0,0,0,0,2,2,2,1,1,1,1,3,3,2,1,1,1,1,1,1,3,0,2
2,1,0,2, ,Ø§ÙØ·Ø¨ Ø§ÙØ¨ÙØ·Ø±Ù,19,5,3,4,3,1, ,4,1,1,1,4,1,2,3,4,4,0,0,0,0,0,0,0,0,0,0,1,0,0,0,0, ,1,1,1,0,0,1,0,0,0,0,0,1,0,1,0,2,0,2,1,0,1,1,2,1,0,0,1,1,2,0,1,0,2,1,2,2,2,2,3,3,3,2,6,5,4,5,4,6,6,5,5,6,6,6,5,6,5,6,1, ,23,ÙØ¨ÙØ§ÙÙ,1,1, ,5, ,0,0,1,0, ,7,4,4,1,1, ,1, ,3,3,0,1,1,0,0,0,1,1,0,0,0, ,2,1,0,17,3,1,22,2,0,86,0,0,0,0,0,0,0,0,0,0,0,3,2,2,1,1,1,3,3,4,2,2,1,1,1,2,1,1,0,1
2,1,0,3, ,Computer science,16,2,1,1,1,1, ,4,1,1,1,1,1,2,3,4,2,0,0,0,0,0,2,0,0,2,0,0,0,0,0,0,ÙÙ Ø£Ø·ÙØ¨ Ø§ÙØ¹ÙØ§Ø¬,0,0,0,1,0,1,0,1,0,0,0,0,0,0,0,1,0,0,0,1,1,0,0,0,0,0,1,1,0,0,0,0,1,0,2,2,2,1,3,2,2,1,5,3,2,4,4,4,4,1,5,4,4,3,1,6,2,6,1, ,20,ÙØ¨ÙØ§ÙÙØ©,1,1, ,5, ,0,0,1,0, ,6,4,2,1,1, ,1, ,3,0,0,0,0,0,0,0,0,0,0,1,0, ,3,1,0,5,1,0,16,2,0,58,0,0,0,0,0,0,1,0,0,1,1,1,1,1,1,1,1,1,3,4,1,2,0,1,1,1,1,1,0,1
2,1,0,1, ,Biology,4,2,4,3,3,1, ,5,1,1,1,5,3,2,4,4,4,0,0,0,0,0,0,0,0,0,2,0,1,0,0,0, ,1,1,2,2,0,1,0,1,0,0,1,1,1,1,1,2,1,1,2,2,2,2,2,3,2,2,0,1,0,1,0,0,3,2,3,2,3,2,1,3,2,1,6,6,5,5,6,6,6,2,4,5,4,5,3,6,2,4,2, ,20,Lebanese,1,2, ,6, ,0,0,1,0, ,5,2,3,1,1, ,1, ,3,3,0,1,1,0,0,0,0,0,0,0,0, ,7,2,0,27,4,1,22,2,0,75,1,0,0,0,0,0,0,0,0,0,0,1,2,2,1,1,1,3,4,4,2,2,1,1,2,3,2,1,0,1
2,1,0,1, ,Biology,4,1,1,3,3,1, ,3,1,1,1,1,2,3,4,5,2,0,0,0,0,0,0,0,0,0,0,0,0,0,0,0,ÙÙ Ø§Ø·ÙØ¨ Ø§ÙØ¹ÙØ§Ø¬,0,0,1,1,1,3,1,1,2,0,0,1,1,2,1,2,1,0,1,1,1,2,1,1,1,1,0,1,1,0,0,0,0,2,1,2,2,2,1,1,2,2,5,5,4,4,4,3,5,4,3,4,5,5,4,6,5,6,2, ,20,Ø³ÙØ±ÙØ©,3,1, ,5, ,0,0,1,0, ,5,4,3,1,2, ,1, ,2,2,0,0,0,0,0,1,0,0,0,0,0, ,10,3,1,19,3,1,15,2,0,72,0,0,0,0,0,0,0,0,0,0,0,1,2,2,1,1,1,1,4,5,2,1,1,1,2,2,2,1,0,1
2,1,0,2, ,Biology,4,1,1,2,2,2,2, ,1,1,1,2,2,2,2,2,4,0,0,0,0,0,0,0,3,0,0,0,0,0,0,0,Ø§ÙÙØ¶Ø¹ Ø§ÙØ¹Ø§Ù ÙÙ ÙØ¨ÙØ§Ù,0,0,2,1,1,3,2,0,2,3,0,2,3,2,2,3,1,2,2,1,2,3,2,2,2,1,0,1,2,0,2,3,3,2,4,2,3,2,3,4,3,3,4,2,5,6,6,5,7,2,6,5,4,4,4,3,4,6,2, ,19,ÙØ¨ÙØ§ÙÙØ©,1,3, ,6, ,0,0,1,0, ,6,4,2,0, , , ,0,3,3,1,0,0,0,0,0,0,0,0,0,1,3,14,3,1,38,4,1,29,3,1,73,1,0,0,0,0,0,0,0,1,1,1,1,1,1,1,1,1,2,2,2,1,2,0,1,2,3,2,2,1,2
2,1,0,1,Ø¥Ø¬Ø§Ø²Ø©,Ø¹ÙÙ ÙÙØ³,1,2,4,4,4,1, ,4,1,1,1,5,2,2,3,3,4,0,0,0,0,0,0,0,0,0,0,0,0,0,0,0,ÙÙ Ø£Ø·ÙØ¨ Ø§ÙØ¹ÙØ§Ø¬,0,0,0,0,1,0,0,0,0,0,0,0,1,0,0,0,0,0,0,0,0,0,0,0,0,0,0,0,0,0,0,0,0,0,1,0,1,0,0,1,0,0, , , , , , , , , , , , , , , , , , , , , , , , , , , , , , , , , , , , , , , , , , , , , , , , , , , , ,1,1,0,1,1,0,3,1,0, , ,0,0,0,0,0,0,0,0,0,0,1,2,2,1,1,1,3,3,3, , , , ,1,1, ,1,0,1
2,1,0,3, ,Psychologie,1,5,3,4,2,1, ,6,1,1,4,3,2,2,2,4,2,0,0,0,0,0,0,0,2,0,0,0,0,1,0,0, ,1,1,2,2,1,1,1,2,1,0,1,0,0,1,2,1,1,3,3,3,2,3,2,2,3,3,3,1,2,2,2,2,2,3,3,2,1,3,1,1,3,2,6,5,5,6,4,4,5,4,4,5,3,4,3,5,3,5,1, ,28,ÙØ¨ÙØ§ÙÙØ©,1,1, ,1, ,0,0,1,0, ,5,2,4,1,1, ,1, ,1,2,0,0,1,0,0,0,0,0,0,0,0, ,11,3,1,41,4,1,21,2,0,71,1,0,0,0,0,0,0,0,1,1,1,3,2,1,1,1,3,2,2,4,2,1,1,1,2,3,1,1,0,1
2,1,0,3, ,Ø¹ÙÙ Ø§ÙÙÙØ³ Ø§ÙØ¹ÙØ§Ø¯Ù,1,3,1,1,1,1, ,3,1,1,1,1,2,2,3,3,3,0,0,0,0,0,0,0,0,0,0,0,0,0,0,0, ,0,0,1,1,0,1,0,1,1,0,0,0,1,0,0,0,0,1,1,0,1,0,0,0,0,0,0,0,0,0,0,0,0,2,2,3,3,1,1,2,2,1, , , , , , , , , , , , , , , , , , , , , , , , , , , , , , , , , , , , , , , , , , , , , , , , , , , , ,5,2,0,4,1,0,17,2,0, , ,0,0,0,0,0,0,0,0,0,0,2,1,1,1,1,1,1,3,3, , , , ,2,1, ,1,0,1
2,1,0,3, ,Ø¹ÙÙ ÙÙØ³ ÙØ§Ø³ØªØ± 1 Ø¹ÙØ§Ø¯Ù,1,3,1,3,3,1, ,3,1,1,1,1,2,1,2,2,1,0,0,0,0,0,0,0,0,0,0,0,1,0,0,0, ,1,1,3,2,2,3,3,3,3,3,3,0,3,3,3,3,3,3,3,3,3,3,3,3,3,3,3,3,3,3,3,1,4,4,4,0,0,4,0,0,4,4,5,5,3,2,4,4,4,4,4,4,4,3,4,4,4,3,2, ,34,ÙØ¨ÙØ§ÙÙØ©,1,1, ,2, ,0,0,0,0,Ø²ÙØ¬Ù Ù Ø§ÙÙØ§Ø¯Ù,6,3,4,1,3, ,1, ,5,0,0,0,0,0,0,0,0,0,0,1,1,3,25,5,1,58,4,1,24,2,0,61,1,0,0,0,0,0,0,0,0,0,0,2,2,2,1,1,1,1,2,2,2,3,1,1,3,3,2,1,0,1
2,1,0,3, ,Ø¹ÙÙ ÙÙØ³,1,1,2,2,2,1, ,3,1,1,1,3,1,1,3,3,4,3,0,3,0,0,0,0,0,0,0,0,0,0,0,0,ÙÙ Ø£Ø·ÙØ¨ Ø¹ÙØ§Ø¬Ø§. ÙØ°Ù ÙØºØ§ÙØ·Ø© Ø§ÙÙØµØ§Ø¯Ø±Ø© Ø¹ÙÙ Ø§ÙÙØ·ÙÙØ¨.,0,0,0,0,0,1,0,1,0,0,0,0,0,0,1,1,0,1,0,0,1,1,0,0,0,0,0,0,0,0,0,1,1,2,2,1,2,2,3,4,1,2,6,4,3,7,6,6,4,5,4,4,4,4,5,5,5,6,1, ,22,ÙØ¨ÙØ§ÙÙ,1,1, ,5, ,0,0,1,0, ,7,4,1,0, , , ,1,2,1,0,0,0,0,0,1,0,0,0,0,0, ,2,1,0,6,1,0,20,2,0,78,0,1,0,1,0,0,0,0,0,2,1,1,1,1,1,1,1,2,3,3,0,1,0,1,1,1,1,1,0,1
2,1,0,3, ,Psychologie,1,4,4,4,4,1, ,4,1,2,1,3,2,2,5,4,4,0,0,0,0,0,0,0,0,0,0,0,0,0,0,0,ÙØ§ Ø´ÙØ¡,0,0,1,2,0,3,0,0,0,0,0,1,2,0,2,1,1,1,1,2,1,1,1,1,1,2,0,2,3,0,0,2,2,2,3,1,2,2,3,2,2,2,6,6,6,7,7,6,7,6,6,6,5,6,6,6,6,6,3, ,25,Ø§ÙÙØ¨ÙØ§ÙÙØ©,1,3, ,2, ,0,1,0,0, ,3,3,3,0, , , ,0,3,1,0,0,0,0,0,0,1,0,0,1,0, ,6,2,0,25,3,1,21,2,0,98,1,0,0,0,0,0,0,0,0,0,0,3,2,2,1,2,1,2,5,4,2,2,1,1,2,2, ,1,0,1
2,1,0,3, ,Ø¹ÙÙ Ø§ÙÙÙØ³,1,5,3,3,3,1, ,3,1,1,1,4,1,1,4,4,3,0,0,0,0,0,0,0,0,0,0,0,0,0,0,1, ,1,1,0,0,0,0,0,0,0,0,0,0,0,0,0,0,0,0,0,0,0,0,0,0,0,0,0,0,0,0,0,0,0,0,0,4,4,0,4,4,0,0,6,6,6,6,6,6,6,6,6,6,6,6,6,6,6,6,2, ,42,ÙØ¨ÙØ§ÙÙØ©,1,1, ,2, ,0,1,0,0, ,4, , , , , , , , , , , , , , , , , , , , , ,0,1,0,0,1,0,16,2,0,96,1,0,0,0,0,0,0,0,0,0,0,3,2,2,1,1,1,3,4,4, , , , ,1,1,2,1,0,1
2,1,0,3, ,Ø¹ÙÙ Ø§ÙÙÙØ³ Ø¹ÙØ§Ø¯Ù / ØªÙØ§ÙÙÙ,1,4,2,3,3,1, ,2,1,1,1,4,1,2,2,3,3,0,0,3,0,0,2,0,3,3,0,0,0,0,0,0,Ø¹ÙØ§Ø¬ Ø°Ø§ØªÙ / ØªØ·ÙÙØ± Ø§ÙÙØ±ÙÙØ© Ø§ÙÙÙØ³ÙØ©,0,0,1,0,0,1,0,0,1,0,0,2,1,2,2,0,0,0,1,0,1,1,0,0,1,0,0,0,0,0,0,0,2,1,2,1,1,1,1,1,1,1,4,5,6,6,6,6,7,7,7,6,6,6,6,6,6,5,2, ,21,Ø§ÙØ¬ÙØ³ÙØ© Ø§ÙÙØ¨ÙØ§ÙÙØ©,1,3, ,5, ,0,0,1,0, ,7,3,3,1,1, ,1, ,3,1,0,1,0,0,0,1,1,1,1,0,1,2,3,1,0,11,2,0,12,1,0,95,0,0,0,1,0,0,1,0,1,3,1,3,2,2,1,1,1,3,2,3,2,2,1,1,1,2,2,1,0,1
2,1,0,3, ,Ø¹ÙÙ ÙÙØ³,1,5,2,2,2,1, ,3,5,1,1,2,2,1,2,5,3,0,2,2,0,3,2,2,2,0,1,0,1,0,1,0, ,2,1,3,3,3,3,3,3,3,3,0,1,2,2,2,2,2,2,2,2,2,2,2,2,2,2,2,2,2,2,2,2,4,4,4,0,0,4,0,0,4,4,3,3,3,3,3,3,3,3,3,3,3,3,3,3,3,3,1, ,29,ÙÙØ³Ø·ÙÙÙ,2,1, ,2, ,0,0,1,0, ,3,4,0,1,1, ,1, ,1,3,0,1,0,0,0,0,0,0,0,0,0, ,24,5,1,41,4,1,24,2,0,48,1,0,1,1,0,1,1,1,1,6,1,3,1,1,3,1,1,2,2,5,0,1,0,1,3,3,1,1,0,1
2,1,0,3, ,Ø¹ÙÙ ÙÙØ³,1,2,3,2,2,1, ,6,1,1,1,3,1,1,2,3,2,0,0,0,0,0,3,1,0,0,0,0,0,0,0,0,Ø§ÙØ§ ÙÙ Ø§Ø·ÙØ¨ Ø¹ÙØ§Ø¬,0,0,0,0,0,1,3,0,0,0,0,2,2,0,2,2,2,2,2,2,2,2,2,2,2,2,2,2,2,2,2,2,2,1,2,1,2,2,2,2,2,1,5,4,6,7,7,7,7,6,7,6,6,5,4,6,6,6,2, ,39,ÙØ¨ÙØ§ÙÙØ©,1,1, ,2, ,0,0,0,0,Ø²ÙØ¬Ù ÙØ§ÙÙØ§Ø¯Ù,5,4,4,1,1, ,1, ,2,1,0,0,1,0,0,0,0,0,0,0,0, ,4,1,0,40,4,1,17,2,0,95,1,0,0,0,0,0,1, ,0,1,1,1,1,1,1,1,1,2,2,3,2,1,1,1,1,3,2,1,0,1
2,1,0,1, ,Ø¹ÙÙ ÙÙØ³,1,4,2,1,1,1, ,2,1,1,1,1,3,3,3,3,4,0,0,0,0,0,0,0,0,0,0,0,0,0,0,0,ÙÙ Ø§Ø·ÙØ¨ Ø¹ÙØ§Ø¬ Ø§Ø¨Ø¯Ø§,0,0,0,0,0,1,0,0,1,0,0,0,0,1,0,0,0,0,0,0,0,0,1,0,0,1,0,0,0,0,0,0,0,0,1,1,1,1,1,2,0,1,5,5,5,5,5,4,6,6,7,7,5,6,4,5,5,6,2, ,42,ÙØ¨ÙØ§ÙÙØ©,1,1, ,5, ,0,0,1,0, ,6,1,4,1,2, ,1, ,3,3,1,1,1,1,1,1,0,0,0,0,0, ,2,1,0,3,1,0,8,1,0,86,0,0,0,0,0,0,0,0,0,0,0,3,1,1,1,1,1,1,3,3,2,2,1,0,1,1,2,1,0,1
2,1,0,3, , Ø¹ÙÙ Ø§ÙÙÙØ³ Ø§ÙØ¹ÙØ§Ø¯Ù,1,3,1,1,1,1, ,4,1,1,1,2,2,3,5,5,3,1,1,1,0,0,0,0,0,0,0,0,0,0,0,0,Ø§Ø³Ø¨Ø§Ø¨ Ø´Ø®ØµÙØ©,0,0,3,3,3,3,3,1,2,2,2,1,3,2,2,3,2,3,2,3,3,2,2,2,1,1,1,3,0,0,0,2,3,4,4,2,4,3,3,3,4,4,3,3,2,1,3,3,4,4,4,5,2,5,1,2,1,1,2, ,22,ÙØ¨ÙØ§ÙÙØ©,1,1, ,6, ,0,0,1,0, ,7,1,1,0, , , ,0,3,1,0,0,0,0,0,0,0,0,1,0,1,3,22,5,1,38,4,1,34,3,1,44,1, , , ,0,0,0,0,0,0,0,2,1,1,1,1,1,2,5,5,0,2,0,0,3,3,2,1,1,1
2,1,0,3, ,Biologie animal,4,5,1,5,3,1, ,5,1,5,1,2,2,2,3,5,2,0,3,0,0,0,2,2,2,2,0,1,1,0,0,0,ÙØ«Ø±Ø© Ø§ÙØ¶Ø¬Ø± Ù Ø§ÙØ¬ÙÙØ³ Ø¨Ø§ÙÙÙØ²Ù Ø§Ø¯Ù Ø§ÙÙ Ø§ØµØ§Ø¨ØªÙ Ø¨Ø§Ù ØªÙÙÙØ± Ø§ÙØ²Ø§Ø¦Ø¯,2,1,1,1,1,3,3,2,1,2,0,1,1,1,2,2,1,1,1,3,2,2,1,1,2,2,0,2,2,0,0,0,4,3,3,2,3,2,2,3,4,2,4,2,5,1,2,6,7,2,5,5,5,5,6,6,3,3,2, ,21,ÙØ¨ÙØ§ÙÙØ©,1,1, ,5, ,0,0,1,0, ,3,3,4,1,1, ,1, ,3,3,0,0,0,0,0,0,0,0,1,0,0, ,14,3,1,27,4,1,28,3,1,67,0,0,1,0,0,0,1,1,1,4,1,3,2,2,1,3,1,2,3,5,2,2,1,1,2,3,2,1,1,1
2,1,0,1, ,PR AND PSYCHOLOGY,1,3,1,1,1,3,1,5,5,5,1,1,2,2,3,5,2,0,0,0,0,0,3,0,2,0,0,0,0,1,0,0, ,1,1,1,2,1,3,2,2,3,0,1,2,2,2,3,3,2,1,2,2,2,2,1,1,2,3,3,2,1,0,1,2,3,3,4,1,2,1,2,2,4,4, , , , , , , , , , , , , , , , , , , , , , , , , , , , , , , , , , , , , , , , , , , , , , , , , , , , ,15,4,1,39,4,1,26,2,1, , ,0,0,0,0,0,1,0,1,2,1,2,1,1,3,3,1,1,3,5, , , , ,3,3, ,1,0,1
2,1,0,3, ,ÙØ§Ø¬Ø³ØªØ± Ø¹ÙÙ ÙÙØ³,1,5,2,2,3,1, ,3,1,1,1,4,1,2,2,5,3,1,0,2,0,0,2,2,0,2,0,0,1,0,0,0, ,1,1,2,1,1,3,0,1,0,0,1,0,0,0,1,3,0,1,1,0,1,1,0,0,1,0,0,0,3,0,0,0,0,1,3,1,2,2,1,2,2,4,7,5,7,5,7,2,6,4,5,7,6,5,5,5,6,4,2, ,33,ÙØ¨ÙØ§ÙÙØ©,1,1, ,2, ,0,1,0,0, ,2,4,3,1,1, ,1, ,3,2,0,0,1,0,0,0,0,0,0,0,0, ,9,2,0,12,2,0,18,2,0,86,1, ,0,1,0,0,1,1,0,3,1,3,1,2,1,1,1,3,2,5,2,2,1,1,2,2,2,1,0,1
2,1,0,3, ,psychology,1,2,1,4,4,1, ,2,1,1,2,1,2,2,5,5,2,3,2,0,0,2,2,0,0,2,0,0,1,0,0,0, ,1,1,3,0,1,3,1,1,3,1,0,2,0,0,3,1,2,3,2,1,3,3,3,2,1,3,2,2,3,0,0,0,4,4,4,1,2,2,1,2,4,2,4,5,3,4,7,6,6,6,1,7,6,6,5,4,4,3,2, ,22,Lebanj e,1,3, ,6, ,0,0,1,0, ,4,1,3,0, , , ,0,2,2,0,0,0,0,0,0,0,1,0,0,1,3,13,3,1,36,4,1,26,2,1,77,1,1,1,0,0,1,1,0,0,4,1,1,2,2,1,1,2,1,5,5,2,1,1,0,2,3,2,1,0,1
2,1,0,3, ,Ø¹ÙÙ ÙÙØ³,1,5,3,4,4,1, ,6,2,1,1,5,1,2,5,5,2,3,0,1,0,0,2,0,0,0,0,0,0,0,0,0,ÙØ´Ø§ÙÙ Ø´Ø®ØµÙØ©,0,0,1,1,1,1,0,3,1,0,0,0,1,1,2,3,1,2,3,2,1,2,1,1,3,2,3,2,2,3,3,2,2,2,3,3,4,3,4,3,3,2,4,5,5,5,2,4,4,3,3,3,2,4,3,4,3,3,2, ,43,ÙØ¨ÙØ§ÙÙØ©,1,1, ,2, ,0,0,1,0, ,5,1,4,1,1, ,1, ,2,3,0,0,0,1,0,1,0,0,0,0,0, ,8,2,0,40,4,1,29,3,1,57,1,1,0, ,0,0,1,0,0,2,1,3,2,2,2,1,1,3,5,5,2,1,1,0,2,3,2,1,1,1
2,1,0,3, ,Ø¹ÙÙ ÙÙØ³,1,5,1,1,1,1, ,3,1,4,1,5,3,2,4,5,2,1,0,0,0,0,0,0,0,0,0,0,1,0,0,0, ,1,1,3,3,1,1,2,1,1,1,1,1,0,2,3,3,1,1,1,2,2,1,2,1,2,2,2,2,0,0,0,0,4,3,3,2,4,2,2,4,2,2,4,3,4,4,4,3,5,5,4,4,4,4,4,4,4,4,2, ,27,ÙØ¨ÙØ§ÙÙØ©,1,1, ,4, ,0,0,1,0, ,6,4,4,0, , , ,1,3,2,0,0,0,0,0,1,0,0,0,0,0, ,14,3,1,28,4,1,28,3,1,64,0, ,0,0,0,0,0,0,0,0,1,3,1,1,1,3,1,3,4,5,2,2,1,1,2,3,2,1,1,1
2,1,0,3, ,Ø¹ÙÙ Ø§ÙÙÙØ³ Ø§ÙØªÙØ§ÙÙÙ,1,1,3,2,4,1, ,5,1,1,1,3,2,1,4,5,4,0,0,0,0,0,0,0,0,0,0,0,0,0,0,0,ÙØ§ Ø´ÙØ¡,0,0,1,1,3,1,2,0,1,1,0,1,0,2,2,1,3,2,0,0,2,1,0,1,0,0,0,0,1,0,0,1,1,1,2,1,1,1,1,2,2,1,4,6,4,4,5,4,6,5,4,5,4,5,3,5,3,4,2, ,21,ÙØ¨ÙØ§ÙÙØ©,1,1, ,5, ,0,0,1,0, ,7,3,2,0, , , ,0,3,1,0,0,0,0,0,1,0,0,0,0,0, ,10,3,1,17,3,1,13,1,0,71,0,0,0,0,0,0,0,0,0,0,0,1,1,2,1,1,1,2,4,5,1,2,0,1,2,2,2,1,0,1
2,1,0,3, ,ÙØ§Ø³ØªØ± 2 Ø¹ÙÙ ÙÙØ³ Ø¹ÙØ§Ø¯Ù,1,3,2,3,3,3,1,3,1,1,1,1,2,2,4,5,4,0,0,1,0,0,3,3,3,0,0,0,0,0,0,0,Ø¸Ø±ÙÙ Ø­ÙØ§ØªÙÙ,0,0,0,1,0,1,0,1,1,0,0,0,0,1,2,3,2,2,2,2,3,1,1,1,1,1,0,1,1,0,0,1,2,1,2,2,1,2,1,1,2,1,6,6,6,6,6,7,6,6,6,6,6,6,6,6,6,6,2, ,36,ÙØ¨ÙØ§ÙÙØ©,1,3, ,5, ,0,0,1,0, ,5,3,4,1,1, ,1, ,1,2,0,0,0,0,0,0,1,0,0,0,0, ,4,1,0,25,3,1,15,2,0,97,0,0,0, ,0,0,1,1,1,3,1,2,2,2,1,1,1,1,4,5,2,1,1,1,1,2,2,1,0,1
2,1,0,3, ,Clinical psychology,1,2,3,1,3,1, ,5,1,3,5,5,2,2,3,4,3,0,0,1,0,0,3,0,0,3,0,0,0,0,0,0,Unreasonable anxiety,0,0,2,0,0,2,0,1,0,0,1,0,0,0,1,0,0,0,1,0,2,0,0,0,0,0,0,0,1,0,0,0,2,1,3,3,2,2,2,2,1,2,5,4,5,4,3,5,5,2,5,5,2,5,5,6,5,4,2, ,21,Syrian,3,3, ,5, ,0,0,1,0, ,4,1,3,1,1, ,1, ,2,1,0,0,0,0,0,0,1,0,0,0,0, ,6,2,0,5,1,0,20,2,0,70,0,0,0, ,0,0,1,0,0,1,1,1,1,2,1,2,3,3,3,4,2,1,1,0,2,1,2,1,0,1
2,1,0,1, ,ÙÙÙÙØ§Ø¡,12,5,3,2,2,1, ,3,1,1,1,4,2,2,2,2,3,0,0,0,0,0,0,0,3,0,0,0,1,0,0,0, ,1,1,1,1,1,1,0,1,1,0,0,2,2,1,1,1,1,2,2,3,2,1,3,0,3,3,3,2,2,0,0,2,2,3,3,2,2,2,2,2,3,2,3,5,3,4,7,6,5,4,5,5,5,4,5,5,4,5,2, ,21,ÙØ¨ÙØ§ÙÙØ©,1,1, ,1, ,0,0,1,0, ,4,2,2,1,1, ,1, ,2,1,0,0,0,0,0,0,0,1,0,0,0, ,6,2,0,36,4,1,23,2,0,75,1,0,0,0,0,0,0,0,1,1,1,3,1,1,1,1,1,3,2,2,1,1,0,1,2,3,2,1,0,1
2,1,0,1,Diploma,Ø¹ÙÙ ÙÙØ³,1,3,3,3,3,1, ,3,1,5,1,4,1,1,2,2,1,0,0,0,0,0,0,0,0,1,1,0,1,0,0,0, ,1,1,1,1,1,1,2,0,1,0,0,1,2,1,1,2,1,2,2,2,2,2,2,2,2,2,0,2,2,2,2,1,2,2,3,1,3,1,2,2,2,2,5,4,5,4,4,5,6,6,7,6,6,6,6,6,6,6,2, ,28,ÙÙØ³Ø·ÙÙØ©,2,1, ,6, ,0,0,1,0, ,4,4,3,0, , , ,0,3,2,0,1,1,1,0,0,0,0,0,0,1,3,7,2,0,35,4,1,20,2,0,88,1,0,0,0,0,0,0,0,0,0,0,2,2,2,1,3,1,3,2,2,2,2,1,1,2,3,2,1,0,1
2,1,0,3, ,Ø¹ÙÙ Ø§ÙÙÙØ³,1,5,2,3,3,1, ,4,1,1,1,2,2,2,3,4,3,0,2,0,0,0,3,0,0,0,0,0,1,1,1,0, ,3,1,3,3,2,2,3,3,1,3,2,2,2,2,3,3,2,2,3,3,2,3,2,3,3,2,0,3,1,2,2,2,3,4,4,4,4,1,2,3,4,3,5,3,4,1,4,2,6,4,2,4,2,6,1,6,1,2,2, ,20,ÙØ¨ÙØ§ÙÙØ©,1,1, ,5, ,0,0,1,0, ,3,4,1,0, , , ,1,5,3,0,0,1,0,0,0,0,0,0,0,0, ,22,5,1,47,4,1,32,3,1,53,0,0,1,0,0,0,1,0,0,2,1,3,2,2,1,1,1,2,3,4,0,3,0,1,3,3,2,1,1,1
2,1,0,1, ,Biology,4,1,4,4,3,3,5,1,1,1,1,4,2,3,3,5,3,0,0,0,0,0,2,2,0,0,0,0,1,0,0,0, ,1,1,2,1,1,1,1,2,3,0,1,0,1,1,2,0,2,2,1,2,1,0,0,0,0,1,0,0,1,0,1,0,2,3,2,1,2,0,2,1,3,1,2,6,4,5,3,5,6,5,7,5,5,3,6,5,5,6,2, ,19,ÙØ¨ÙØ§ÙÙØ©,1,1, ,5, ,0,0,0,0,Ø§ÙØ¬Ø¯Ø© Ù Ø§Ø®ÙØªÙ Ø§ÙÙØ¨Ø§Ø±,6,4,2,1,1, ,1, ,3,1,0,0,1,0,0,0,0,1,0,0,0, ,12,3,1,15,2,0,17,2,0,78,0,0,0,0,0,0,1,1,0,2,1,1,2,2,1,1,1,3,3,5,1,2,0,1,2,2,2,5,0,2
2,1,0,1, ,Biology,4,5,2,4,2,1, ,3,1,1,1,3,2,3,2,3,2,0,0,0,0,0,1,0,0,1,0,1,1,0,0,0, ,2,1,3,2,0,3,1,3,1,1,0,0,0,0,0,2,0,1,1,1,3,1,0,0,2,1,0,3,0,0,0,0,2,4,4,0,2,2,3,3,3,4, , , , , , , , , , , , , , , , , , , , , , , , , , , , , , , , , , , , , , , , , , , , , , , , , , , , ,14,3,1,15,2,0,27,3,1, , ,0,0,0,0,0, ,0,0,0,0,3,2,1,1,1,1,2,2,3, , , , ,2,2, ,1,1,1
2,1,0,1,ÙÙØ³ÙÙØ³,Ø¹ÙÙÙ Ø§Ø¬ØªÙØ§Ø¹ÙØ©,2,5,2,3,3,1, ,4,1,1,1,2,2,1,5,3,3,2,0,2,0,0,2,2,0,0,0,0,0,0,0,0,ØªØ±Ø§ÙÙØ§Øª ÙÙ Ø§ÙÙØ§Ø¶Ù Ù ÙØ´Ø§ÙÙÙØ Ø¥Ø¶Ø§ÙØ© Ø¥ÙÙ Ø§ÙÙØ´Ø§ÙÙ Ø§ÙØ£Ø³Ø±ÙØ©,0,0,0,1,0,3,0,1,0,0,0,0,2,0,2,1,2,1,2,0,2,3,0,0,0,3,0,0,2,1,1,1,2,4,4,0,0,0,0,0,2,0,6,2,6,4,4,6,7,4,6,6,5,6,6,6,6,6,2, ,20,ÙØ¨ÙØ§ÙÙØ©,1,1, ,5, ,0,0,1,0, ,4,4,2,1,1, ,1, ,3,0,0,0,0,0,0,0,1,0,0,0,0, ,5,2,0,23,3,1,12,1,0,86,0,1,0,1,0,0,1,1,0,4,1,3,2,2,1,1,1,2,5,3,1,2,0,1,2,2,2,1,0,1
2,1,0,3, ,Ø¹ÙÙ ÙÙØ³ Ø¹ÙØ§Ø¯Ù ÙÙÙÙ,1,3,1,1,1,3,1,4,4,1,1,1,3,3,3,5,1,3,3,1,0,3,0,0,0,0,0,0,0,0,0,0,Ø§ÙØ§ Ø§Ø¹Ø§ÙÙ ÙÙ ÙØ±Ø¶ ÙÙØ³Ù ÙØ²ÙÙ,0,0,3,3,3,3,3,2,1,2,0,1,2,1,3,3,1,1,3,2,3,3,2,3,3,2,3,2,2,1,1,2,4,3,4,2,2,3,3,3,3,3,5,3,1,3,4,4,3,3,3,3,2,3,3,4,3,4,2, ,56,ÙØ¨ÙØ§ÙÙØ©,1,1, ,2, ,0,1,0,0, ,3,4,2,1,2, ,1, ,3,2,0,1,0,1,0,0,0,0,0,0,0, ,20,5,1,44,4,1,30,3,1,51,1,1,1, ,0,1,0,0,0,3,1,2,1,1,3,1,1,1,3,5,1,2,0,1,3,3,2,1,1,1
2,1,0,3, ,Ø¹ÙÙÙ Ø§ÙØ­ÙØ§Ø© ÙØ§ÙØ§Ø±Ø¶,4,5,2,4,2,3,3,6,1,1,1,1,2,1,5,3,2,0,0,0,0,0,0,0,0,0,0,1,0,0,0,0, ,1,1,1,2,3,1,2,2,2,1,1,1,2,1,1,3,3,3,3,3,2,3,2,2,2,3,3,2,2,2,2,2,2,3,3,2,2,2,1,2,3,3,5,5,2,5,5,5,5,5,6,5,5,4,4,6,6,6,2, ,20,ÙØ¨ÙØ§ÙÙØ©,1,3, ,5, ,0,0,1,0, ,8,3,2,0, , , ,0,5,1,0,0,0,1,0,0,0,0,0,1,0, ,15,4,1,47,4,1,23,2,0,79,0,0,0,0,0,0,0,0,0,0,0,3,2,1,1,1,1,1,5,3,1,3,0,1,3,3,2,3,0,2
2,1,0,3, ,Ø¹ÙÙ ÙÙØ³,1,3,2,2,2,1, ,4,1,1,1,3,1,1,4,5,3,0,3,0,0,0,2,0,0,2,0,1,1,1,0,0, ,3,1,3,3,3,3,3,3,2,0,2,1,1,0,1,3,1,1,2,2,3,2,0,0,3,1,0,1,1,0,0,0,3,4,4,3,4,4,3,3,4,4, , , , , , , , , , , , , , , , , , , , , , , , , , , , , , , , , , , , , , , , , , , , , , , , , , , , ,22,5,1,23,3,1,36,3,1, , ,0,1,0,0,0,1,0,0,2,1,2,1,1,1,1,1,2,4,5, , , , ,3,2, ,1,1,1
2,1,0,1, ,ÙÙÙÙØ§Ø¡,12,1,2,3,2,1, ,3,1,1,1,3,2,2,4,5,3,0,0,0,0,0,2,0,2,0,0,0,1,0,0,0, ,1,1,2,1,1,1,2,2,1,1,0,1,0,1,1,2,1,0,1,0,1,1,1,1,0,0,0,1,2,0,0,0,3,2,3,1,2,2,3,2,3,2,3,3,5,4,5,5,6,6,6,5,4,4,6,5,6,5,2, ,20,ÙØ¨ÙØ§ÙÙØ©,1,1, ,6, ,0,0,1,0, ,5,4,3,0, , , ,1,3,2,0,0,1,0,0,0,0,0,0,0,1,2,11,3,1,14,2,0,23,2,0,78,1,0,0,0,0,0,1,0,1,2,1,1,2,1,1,1,1,2,4,5,2,2,1,1,2,2,2,1,0,1
2,1,0,4, ,medicine,7,1,1,3,1,1, ,5,1,1,4,2,2,3,3,5,1,0,0,0,0,0,2,2,3,2,0,0,0,0,0,1,Inabiioilty to sleep,1,1,2,2,3,2,3,1,1,3,0,0,2,0,3,1,0,1,1,1,3,2,0,0,2,0,0,1,3,0,2,1,3,3,4,3,3,2,3,3,3,3,4,1,4,3,3,6,6,6,1,5,5,6,4,5,4,6,2, ,22,Lebanese Brazilian,1,3, ,5, ,0,0,1,0, ,5,0,4,1,1, ,1, ,1,1,0,0,1,0,0,0,0,1,0,0,1,2,17,4,1,23,3,1,30,3,1,69,0,0,0,0,0,0,1,1,1,3,1,1,2,1,1,1,3,2,3,5,2,1,1,0,3,2,2,1,1,1
2,1,0,3, ,Clinical psychology,1,3,3,3,3,3,1,4,1,3,4,2,1,2,3,5,4,0,0,2,0,0,3,3,3,1,0,0,1,0,0,0,ÙÙØª Ø§Ø­Ø¯ Ø§ÙØ§ÙØ§Ø±Ø¨Ø ÙØ¬Ø±Ø© Ø§ÙØ§ØµØ¯ÙØ§Ø¡Ø Ø²ÙØ§Ø¯Ø© Ø§ÙÙÙÙ,1,1,0,0,0,1,1,0,2,0,0,2,1,0,2,2,1,1,1,2,2,0,2,1,1,0,0,1,1,0,1,2,1,2,2,1,1,1,1,1,2,1,3,3,4,4,6,5,5,5,3,5,4,5,4,4,4,3,2, ,30,ÙØ¨ÙØ§ÙÙØ©,1,3, ,1, ,0,0,1,0, ,3,0,3,1,1, ,1, ,3,1,0,0,0,0,0,0,0,0,0,1,0, ,4,1,0,23,3,1,13,1,0,67,1,0,0,1,0,0,1,1,1,4,1,2,2,2,1,2,3,2,3,5,2,2,1,0,1,2,2,1,0,1
2,1,0,3, ,Ø¹ÙÙ ÙÙØ³ Ø¹ÙØ§Ø¯Ù ØªÙØ§ÙÙÙ,1,3,2,3,3,1, ,2,1,1,1,1,2,2,2,3,2,0,0,0,0,0,0,0,2,0,0,0,0,0,0,0,ÙÙ Ø§Ø·ÙØ¨ Ø§ÙØ¹ÙØ§Ø¬,0,0,1,1,0,1,1,1,1,0,0,1,1,2,3,2,2,3,3,3,3,3,2,1,2,3,3,3,2,3,2,2,1,0,1,2,2,0,1,1,2,0,4,3,4,4,4,5,6,6,5,5,5,6,5,6,5,5,2, ,24,ÙØ¨ÙØ§ÙÙØ©,1,1, ,5, ,0,0,1,0, ,8,3,4,0, , , ,0,4,2,0,0,0,1,0,0,0,0,0,0,1,2,6,2,0,49,4,1,10,1,0,78,0,0,0,0,0,0,0,0,1,1,1,2,2,2,1,1,1,1,2,3,2,3,1,1,2,3,2,1,0,1
2,1,0,3, ,Clinical psychology,1,2,3,1,1,1, ,6,1,5,1,2,2,2,3,5,2,0,0,0,0,0,2,0,0,0,0,0,0,0,0,0,ÙÙ Ø§Ø·ÙØ¨ Ø§ÙØ¹ÙØ§Ø¬,0,0,2,1,1,2,3,1,3,1,1,2,2,1,0,0,1,0,0,0,1,0,0,0,0,1,2,0,2,0,2,2,2,4,3,2,2,3,2,3,3,2, , , , , , , , , , , , , , , , , , , , , , , , , , , , , , , , , , , , , , , , , , , , , , , , , , , , ,15,4,1,16,3,1,26,2,1, , ,0,0,0,0,0,1,0,0,1,1,1,1,1,1,3,1,2,3,5, , , , ,3,2, ,1,0,1
2,1,0,1, ,Ø¹ÙÙ Ø§ÙÙÙØ³,1,3,2,3,3,2,2, ,1,1,1,3,1,1,2,3,4,0,0,0,0,0,0,0,0,0,0,0,0,0,0,0,ÙÙ Ø£Ø·ÙØ¨ Ø§ÙØ¹ÙØ§Ø¬,0,0,0,0,0,1,1,0,0,0,0,0,1,0,1,0,0,0,1,0,1,0,0,0,0,0,0,0,1,0,1,1,1,1,2,1,1,1,1,1,1,1,5,4,4,5,6,6,5,5,6,6,6,5,5,5,5,5,2, ,23,Ø§ÙÙØ¨ÙØ§ÙÙØ©,1,3, ,2, ,0,1,0,0, ,3,4,4,0, , , ,0,4,3,0,0,0,0,0,1,0,1,0,0,0, ,2,1,0,7,1,0,11,1,0,83,1,0,0,0,0,0,0,0,0,0,0,2,2,2,1,1,1,2,2,3,2,3,1,1,1,1,2,2,0,2
2,1,0,1, ,Biology,4,1,3,2,2,1, ,4,1,3,1,3,1,2,2,4,5,0,0,0,0,0,0,0,0,0,0,0,0,0,0,0,ÙÙ Ø£Ø·ÙØ¨ Ø§ÙØ¹ÙØ§Ø¬,0,0,0,0,0,1,0,0,1,0,0,0,0,1,0,0,0,0,0,0,0,0,0,0,0,0,0,0,0,0,0,0,1,1,1,0,1,0,1,1,1,0,7,6,7,4,5,5,7,6,7,7,6,6,5,6,4,6,1, ,19,ÙØ¨ÙØ§ÙÙ,1,3, ,5, ,0,0,1,0, ,4,4,4,1,1, ,1, ,3,1,0,0,0,0,0,1,0,0,0,0,1,3,2,1,0,1,1,0,7,1,0,94,0,0,0,0,0,0,0,0,0,0,0,1,1,1,1,2,1,2,2,4,2,2,1,1,1,1,1,1,0,1